{"text_format":"1","workbook":"xlsx","n_sheets":2,"sheets":["Zestawienie","TabelaCen"],"not_rendered":{"charts":0,"images":0,"macros":1,"external_links":0,"defined_names":39,"comments":1,"pivot_tables":0},"unopened":[],"bounds":{"document_bytes":16777216,"sheet_cells":100000,"rows_first":2000,"rows_last":500,"rows_between":2000,"halvings":0,"cell_chars":16384,"cell_head_chars":4096},"cells_cut":0,"cells_raw":0,"read":"whole","date_system":"1900"}

{"sheet":"Zestawienie","index":0,"n_rows":500,"n_cols":24,"rows_kept":500,"cut":false,"hidden":false,"merged":[]}
[]
[]
[]
[]
[]
[]
[]
[]
[]
[]
[]
[]
[]
[]
[]
[]
[]
[]
[]
[]
[]
[]
[]
[]
[]
[]
[]
[]
[]
[]
[]
[]
[]
[]
[]
[]
[]
[]
[]
[]
[]
[]
[]
[]
[]
[]
[]
[]
[]
[]
[]
[]
[]
[null,null,null,null,null,null,null,null,null,null,null,null,null,null,null,null,null,null,null,null,null,null,null,"RABAT"]
[null,null,null,null,null,null,null,null,null,null,null,null,null,null,null,null,null,null,null,null,null,null,null,0.3]
[]
["URZĄDZENIE",null,null,"TYP","KOD","OPIS",null,null,null,null,null,null,null,null,null,null,null,null,null,null,null,null,"CENA EURO","KONCOWA EURO"]
[null,"Type","Size","Model","ItemCode","Description","Remark","RPM","Voltage","Size2","Power","Torque","Encoder","Brake","ServoDriver",null,null,null,null,null,null,null,{"$f":"VLOOKUP(E60,TabelaCen!A3:C989,3,FALSE)","v":{"$error":"#N/A"}}]
["SERWOSILNIK","APMC-FAL","40 AL Flange ","APMC-FALR5AYN",4716142700,{"$f":"CONCATENATE(\"Serwosilnik\",\", \",B59,\", \",J59,\", \",L59,\", \",H59,\"obr/min, \",K59,\", \",N59,\", \",M59,\", \",D59,\", \",E59)","v":"Serwosilnik, APMC-FAL, 40mm, 0.16Nm, 3000obr/min, 50w, bez hamulca, Serial Enc. 17Bit MT, APMC-FALR5AYN, 4716142700"},"□40, 50w, 0.16Nm, Serial Enc.17 Bit MT, [L7CA001U]",3000,200,"40mm","50w","0.16Nm","Serial Enc. 17Bit MT","bez hamulca"," [L7CA001U]",null,null,null,null,null,null,null,{"$f":"VLOOKUP(E59,TabelaCen!$B$2:$C$988,2,FALSE)","v":272.95},{"$f":"W59-(W59*$X$55)","v":191.065}]
["SERWOSILNIK","APMC-FAL","40 AL Flange ","APMC-FAL01AYN",4716142800,"Serwosilnik, APMC-FAL, 40mm, 0.32Nm, 3000obr/min, 100w, bez hamulca, Serial Enc. 17Bit MT, APMC-FAL01AYN, 4716142800","□40, 100w, 0.32Nm, Serial Enc.17 Bit MT, [L7CA001U]",3000,200,"40mm","100w","0.32Nm","Serial Enc. 17Bit MT","bez hamulca"," [L7CA001U]",null,null,null,null,null,null,null,{"$f":"VLOOKUP(E60,TabelaCen!$B$2:$C$988,2,FALSE)","v":294.58},206.20599999999999]
["SERWOSILNIK","APMC-FAL","40 AL Flange ","APMC-FAL015AYN",4716142900,"Serwosilnik, APMC-FAL, 40mm, 0.48Nm, 3000obr/min, 150w, bez hamulca, Serial Enc. 17Bit MT, APMC-FAL015AYN, 4716142900","□40, 150w, 0.48Nm, Serial Enc.17 Bit MT, [L7CA002U]",3000,200,"40mm","150w","0.48Nm","Serial Enc. 17Bit MT","bez hamulca"," [L7CA002U]",null,null,null,null,null,null,null,{"$f":"VLOOKUP(E61,TabelaCen!$B$2:$C$988,2,FALSE)","v":326.51},228.55700000000002]
["SERWOSILNIK","APMC-FAL","40 AL Flange ","APMC-FALR5AYN2",4716143000,"Serwosilnik, APMC-FAL, 40mm, 0.16Nm, 3000obr/min, 50w, z hamulcem, Serial Enc. 17Bit MT, APMC-FALR5AYN2, 4716143000","□40, 50w, 0.16Nm, Serial Enc.17 Bit MT, Brake, [L7CA001U]",3000,200,"40mm","50w","0.16Nm","Serial Enc. 17Bit MT","z hamulcem"," [L7CA001U]",null,null,null,null,null,null,null,{"$f":"VLOOKUP(E62,TabelaCen!$B$2:$C$988,2,FALSE)","v":415.09000000000003},290.56300000000005]
["SERWOSILNIK","APMC-FAL","40 AL Flange ","APMC-FAL01AYN2",4716143100,"Serwosilnik, APMC-FAL, 40mm, 0.32Nm, 3000obr/min, 100w, z hamulcem, Serial Enc. 17Bit MT, APMC-FAL01AYN2, 4716143100","□40, 100w, 0.32Nm, Serial Enc.17 Bit MT, Brake, [L7CA001U]",3000,200,"40mm","100w","0.32Nm","Serial Enc. 17Bit MT","z hamulcem"," [L7CA001U]",null,null,null,null,null,null,null,{"$f":"VLOOKUP(E63,TabelaCen!$B$2:$C$988,2,FALSE)","v":437.75},306.42500000000001]
["SERWOSILNIK","APMC-FAL","40 AL Flange ","APMC-FALR5AM8N",4716097400,"Serwosilnik, APMC-FAL, 40mm, 0.16Nm, 3000obr/min, 50w, bez hamulca, Serial Enc. 18Bit MT, APMC-FALR5AM8N, 4716097400","□40, 50w, 0.16Nm, Serial Enc.18 Bit MT, [L7□A001U]",3000,200,"40mm","50w","0.16Nm","Serial Enc. 18Bit MT","bez hamulca"," [L7□A001U]",null,null,null,null,null,null,null,{"$f":"VLOOKUP(E64,TabelaCen!$B$2:$C$988,2,FALSE)","v":347.11},242.97700000000003]
["SERWOSILNIK","APMC-FAL","40 AL Flange ","APMC-FAL01AM8N",4716089800,"Serwosilnik, APMC-FAL, 40mm, 0.32Nm, 3000obr/min, 100w, bez hamulca, Serial Enc. 18Bit MT, APMC-FAL01AM8N, 4716089800","□40, 100w, 0.32Nm, Serial Enc.18 Bit MT, [L7□A001U]",3000,200,"40mm","100w","0.32Nm","Serial Enc. 18Bit MT","bez hamulca"," [L7□A001U]",null,null,null,null,null,null,null,{"$f":"VLOOKUP(E65,TabelaCen!$B$2:$C$988,2,FALSE)","v":356.38},249.46600000000001]
["SERWOSILNIK","APMC-FAL","40 AL Flange ","APMC-FAL015AM8N",4716097500,"Serwosilnik, APMC-FAL, 40mm, 0.48Nm, 3000obr/min, 150w, bez hamulca, Serial Enc. 18Bit MT, APMC-FAL015AM8N, 4716097500","□40, 150w, 0.48Nm, Serial Enc.18 Bit MT, [L7□A004U]",3000,200,"40mm","150w","0.48Nm","Serial Enc. 18Bit MT","bez hamulca"," [L7□A004U]",null,null,null,null,null,null,null,{"$f":"VLOOKUP(E66,TabelaCen!$B$2:$C$988,2,FALSE)","v":387.28000000000003},271.096]
["SERWOSILNIK","APMC-FAL","40 AL Flange ","APMC-FALR5AM8N2",4716103200,"Serwosilnik, APMC-FAL, 40mm, 0.16Nm, 3000obr/min, 50w, z hamulcem, Serial Enc. 18Bit MT, APMC-FALR5AM8N2, 4716103200","□40, 50w, 0.16Nm, Serial Enc.18 Bit MT, Brake, [L7□A001U]",3000,200,"40mm","50w","0.16Nm","Serial Enc. 18Bit MT","z hamulcem"," [L7□A001U]",null,null,null,null,null,null,null,{"$f":"VLOOKUP(E67,TabelaCen!$B$2:$C$988,2,FALSE)","v":543.84},380.68799999999999]
["SERWOSILNIK","APMC-FAL","40 AL Flange ","APMC-FAL01AM8N2",4716103300,"Serwosilnik, APMC-FAL, 40mm, 0.32Nm, 3000obr/min, 100w, z hamulcem, Serial Enc. 18Bit MT, APMC-FAL01AM8N2, 4716103300","□40, 100w, 0.32Nm, Serial Enc.18 Bit MT, Brake, [L7□A001U]",3000,200,"40mm","100w","0.32Nm","Serial Enc. 18Bit MT","z hamulcem"," [L7□A001U]",null,null,null,null,null,null,null,{"$f":"VLOOKUP(E68,TabelaCen!$B$2:$C$988,2,FALSE)","v":525.30000000000007},367.71000000000004]
["SERWOSILNIK","APMC-FAL","40 AL Flange ","APMC-FAL015AM8K2",4716081500,"Serwosilnik, APMC-FAL, 40mm, 0.48Nm, 3000obr/min, 150w, z hamulcem, Serial Enc. 18Bit MT, APMC-FAL015AM8K2, 4716081500","□40, 150w, 0.48Nm, Serial Enc.18 Bit MT, Brake, [L7□A004U]",3000,200,"40mm","150w","0.48Nm","Serial Enc. 18Bit MT","z hamulcem"," [L7□A004U]",null,null,null,null,null,null,null,{"$f":"VLOOKUP(E69,TabelaCen!$B$2:$C$988,2,FALSE)","v":{"$error":"#N/A"}},{"$error":"#N/A"}]
["SERWOSILNIK","APMC-FBL","60 BL Flange ","APMC-FBL01AYK",4716143700,"Serwosilnik, APMC-FBL, 60mm, 0.32Nm, 3000obr/min, 100w, bez hamulca, Serial Enc. 17Bit MT, APMC-FBL01AYK, 4716143700","□60, 100w, 0.32Nm, Serial Enc.17 Bit MT, [L7CA001U]",3000,200,"60mm","100w","0.32Nm","Serial Enc. 17Bit MT","bez hamulca"," [L7CA001U]",null,null,null,null,null,null,null,{"$f":"VLOOKUP(E70,TabelaCen!$B$2:$C$988,2,FALSE)","v":258.53000000000003},180.971]
["SERWOSILNIK","APMC-FBL","60 BL Flange ","APMC-FBL02AYK",4716143800,"Serwosilnik, APMC-FBL, 60mm, 0.64Nm, 3000obr/min, 200w, bez hamulca, Serial Enc. 17Bit MT, APMC-FBL02AYK, 4716143800","□60, 200w, 0.64Nm, Serial Enc.17 Bit MT, [L7CA002U]",3000,200,"60mm","200w","0.64Nm","Serial Enc. 17Bit MT","bez hamulca"," [L7CA002U]",null,null,null,null,null,null,null,{"$f":"VLOOKUP(E71,TabelaCen!$B$2:$C$988,2,FALSE)","v":282.22000000000003},197.55400000000003]
["SERWOSILNIK","APMC-FBL","60 BL Flange ","APMC-FBL04AYK",4716143900,"Serwosilnik, APMC-FBL, 60mm, 1.27Nm, 3000obr/min, 400w, bez hamulca, Serial Enc. 17Bit MT, APMC-FBL04AYK, 4716143900","□60, 400w, 1.27Nm, Serial Enc.17 Bit MT, [L7CA004U]",3000,200,"60mm","400w","1.27Nm","Serial Enc. 17Bit MT","bez hamulca"," [L7CA004U]",null,null,null,null,null,null,null,{"$f":"VLOOKUP(E72,TabelaCen!$B$2:$C$988,2,FALSE)","v":295.61},206.92700000000002]
["SERWOSILNIK","APMC-FBL","60 BL Flange ","APMC-FBL01AYK2",4716144300,"Serwosilnik, APMC-FBL, 60mm, 0.32Nm, 3000obr/min, 100w, z hamulcem, Serial Enc. 17Bit MT, APMC-FBL01AYK2, 4716144300","□60, 100w, 0.32Nm, Serial Enc.17 Bit MT, Brake, [L7CA001U]",3000,200,"60mm","100w","0.32Nm","Serial Enc. 17Bit MT","z hamulcem"," [L7CA001U]",null,null,null,null,null,null,null,{"$f":"VLOOKUP(E73,TabelaCen!$B$2:$C$988,2,FALSE)","v":473.8},331.66]
["SERWOSILNIK","APMC-FBL","60 BL Flange ","APMC-FBL02AYK2",4716144400,"Serwosilnik, APMC-FBL, 60mm, 0.64Nm, 3000obr/min, 200w, z hamulcem, Serial Enc. 17Bit MT, APMC-FBL02AYK2, 4716144400","□60, 200w, 0.64Nm, Serial Enc.17 Bit MT, Brake, [L7CA002U]",3000,200,"60mm","200w","0.64Nm","Serial Enc. 17Bit MT","z hamulcem"," [L7CA002U]",null,null,null,null,null,null,null,{"$f":"VLOOKUP(E74,TabelaCen!$B$2:$C$988,2,FALSE)","v":496.46000000000004},347.52200000000005]
["SERWOSILNIK","APMC-FBL","60 BL Flange ","APMC-FBL04AYK2",4716144500,"Serwosilnik, APMC-FBL, 60mm, 1.27Nm, 3000obr/min, 400w, z hamulcem, Serial Enc. 17Bit MT, APMC-FBL04AYK2, 4716144500","□60, 400w, 1.27Nm, Serial Enc.17 Bit MT, Brake, [L7CA004U]",3000,200,"60mm","400w","1.27Nm","Serial Enc. 17Bit MT","z hamulcem"," [L7CA004U]",null,null,null,null,null,null,null,{"$f":"VLOOKUP(E75,TabelaCen!$B$2:$C$988,2,FALSE)","v":509.85},356.89499999999998]
["SERWOSILNIK","APMC-FBL","60 BL Flange ","APMC-FBL01AMK",4716080000,"Serwosilnik, APMC-FBL, 60mm, 0.32Nm, 3000obr/min, 100w, bez hamulca, Serial Enc. 19Bit MT, APMC-FBL01AMK, 4716080000","□60, 100w, 0.32Nm, Serial Enc.19 Bit MT, [L7□A001U]",3000,200,"60mm","100w","0.32Nm","Serial Enc. 19Bit MT","bez hamulca"," [L7□A001U]",null,null,null,null,null,null,null,{"$f":"VLOOKUP(E76,TabelaCen!$B$2:$C$988,2,FALSE)","v":310.03000000000003},217.02100000000002]
["SERWOSILNIK","APMC-FBL","60 BL Flange ","APMC-FBL02AMK",4716080100,"Serwosilnik, APMC-FBL, 60mm, 0.64Nm, 3000obr/min, 200w, bez hamulca, Serial Enc. 19Bit MT, APMC-FBL02AMK, 4716080100","□60, 200w, 0.64Nm, Serial Enc.19 Bit MT, [L7□A002U]",3000,200,"60mm","200w","0.64Nm","Serial Enc. 19Bit MT","bez hamulca"," [L7□A002U]",null,null,null,null,null,null,null,{"$f":"VLOOKUP(E77,TabelaCen!$B$2:$C$988,2,FALSE)","v":332.69},232.88299999999998]
["SERWOSILNIK","APMC-FBL","60 BL Flange ","APMC-FBL04AMK",4716080200,"Serwosilnik, APMC-FBL, 60mm, 1.27Nm, 3000obr/min, 400w, bez hamulca, Serial Enc. 19Bit MT, APMC-FBL04AMK, 4716080200","□60, 400w, 1.27Nm, Serial Enc.19 Bit MT, [L7□A004U]",3000,200,"60mm","400w","1.27Nm","Serial Enc. 19Bit MT","bez hamulca"," [L7□A004U]",null,null,null,null,null,null,null,{"$f":"VLOOKUP(E78,TabelaCen!$B$2:$C$988,2,FALSE)","v":346.08},242.25599999999997]
["SERWOSILNIK","APMC-FBL","60 BL Flange ","APMC-FBL01AMK2",4716081600,"Serwosilnik, APMC-FBL, 60mm, 0.32Nm, 3000obr/min, 100w, z hamulcem, Serial Enc. 19Bit MT, APMC-FBL01AMK2, 4716081600","□60, 100w, 0.32Nm, Serial Enc.19 Bit MT, Brake, [L7□A001U]",3000,200,"60mm","100w","0.32Nm","Serial Enc. 19Bit MT","z hamulcem"," [L7□A001U]",null,null,null,null,null,null,null,{"$f":"VLOOKUP(E79,TabelaCen!$B$2:$C$988,2,FALSE)","v":531.48},372.03600000000006]
["SERWOSILNIK","APMC-FBL","60 BL Flange ","APMC-FBL02AMK2",4716081700,"Serwosilnik, APMC-FBL, 60mm, 0.64Nm, 3000obr/min, 200w, z hamulcem, Serial Enc. 19Bit MT, APMC-FBL02AMK2, 4716081700","□60, 200w, 0.64Nm, Serial Enc.19 Bit MT, Brake, [L7□A002U]",3000,200,"60mm","200w","0.64Nm","Serial Enc. 19Bit MT","z hamulcem"," [L7□A002U]",null,null,null,null,null,null,null,{"$f":"VLOOKUP(E80,TabelaCen!$B$2:$C$988,2,FALSE)","v":557.23},390.06100000000004]
{"$rows_left_out":421}
{"sheet":"TabelaCen","index":1,"n_rows":988,"n_cols":5,"rows_kept":988,"cut":false,"hidden":false,"merged":[]}
["Part Number","ERP CODE","Price EUR",null,"STARA CENA"]
["L7CA001U",4715016200,345.05,null,335]
["L7CA002U",4715016300,345.05,null,335]
["L7CA004U",4715016400,349.17,null,339]
["L7CA008U",4715016500,400.67,null,389]
["L7CA010U",4715016600,413.03000000000003,null,401]
["L7SA001A",4715000100,472.77000000000004,null,459]
["L7SA002A",4715000200,475.86,null,462]
["L7SA004A",4715000300,483.07,null,469]
["L7SA008A",4715000400,603.58000000000004,null,586]
["L7SA010A",4715000500,609.76,null,592]
["L7SA020A",4715000600,839.45,null,815]
["L7SA035A",4715000700,860.05000000000007,null,835]
["L7SA050A",4715002300,1469.81,null,1427]
["L7SA001B",4715000800,475.86,null,462]
["L7SA002B",4715000900,479.98,null,466]
["L7SA004B",4715001000,486.16,null,472]
["L7SA008B",4715001100,607.70000000000005,null,590]
["L7SA010B",4715001200,613.88,null,596]
["L7SA020B",4715001300,842.54000000000008,null,818]
["L7SA035B",4715001400,864.17000000000007,null,839]
["L7SA050B",4715002400,1472.9,null,1430]
["L7NHA001U",4715004300,539.72,null,524]
["L7NHA002U",4715004400,542.81000000000006,null,527]
["L7NHA004U",4715004500,550.02,null,534]
["L7NHA008U",4715004600,659.2,null,640]
["L7NHA010U",4715002800,663.32,null,644]
["L7NHA020U",4715004700,894.04000000000008,null,868]
["L7NHA035U",4715004800,915.67000000000007,null,889]
["L7NHA050U",4715008500,1528.52,null,1484]
["L7NHA075U",4715009200,2221.71,null,2157]
["L7NHA150U",4715009300,3245.53,null,3151]
["L7NHFA010U",4715012400,886.83,null,861]
["L7NHFA035U",4715012500,1428.6100000000001,null,1387]
["L7NHFA050U",4715012600,1575.9,null,1530]
["L7NHFA075U",4715012700,2274.2400000000002,null,2208]
["L7PA001U",4715005500,497.49,null,483]
["L7PA002U",4715005600,501.61,null,487]
["L7PA004U",4715005700,508.82,null,494]
["L7PA008U",4715005800,616.97,null,599]
["L7PA010U",4715005900,622.12,null,604]
["L7PA020U",4715006000,899.19,null,873]
["L7PA035U",4715006100,874.47,null,849]
["L7PA050U",4715006200,1487.32,null,1444]
["L7PA075U",4715006300,2180.5100000000002,null,2117]
["L7PA150U",4715006400,3200.21,null,3107]
["L7SB010B",4715003800,660.23,null,641]
["L7SB020B",4715003900,894.04000000000008,null,868]
["L7SB035B",4715004000,909.49,null,883]
["L7SB050B",4715004100,1455.39,null,1413]
["L7SB075B",4715004200,1674.78,null,1626]
["L7SB150B",4715002600,2839.71,null,2757]
["L7NHB010U",4715004900,715.85,null,695]
["L7NHB020U",4715005000,949.66,null,922]
["L7NHB035U",4715005100,965.11,null,937]
["L7NHB050U",4715005200,1508.95,null,1465]
["L7NHB075U",4715005300,1729.3700000000001,null,1679]
["L7NHB150U",4715005400,2975.67,null,2889]
["L7PB010U",4715008600,672.59,null,653]
["L7PB020U",4715008700,907.43000000000006,null,881]
["L7PB035U",4715008800,921.85,null,895]
["L7PB050U",4715008900,1453.33,null,1411]
["L7PB075U",4715009000,1686.1100000000001,null,1637]
["L7PB150U",4715009100,2848.98,null,2766]
["APM-SAR3ACN",4716004300,378.01,null,367]
["APM-SAR5ACN",4716004400,391.40000000000003,null,380]
["APM-SA01ACN",4716004500,416.12,null,404]
["APM-SA015ACN",4716004600,443.93,null,431]
["APM-SB01ADK",4716004700,341.96000000000004,null,332]
["APM-SB02ADK",4716004800,364.62,null,354]
["APM-SB04ADK",4716004900,400.67,null,389]
["APM-SC04ADK",4716005000,409.94,null,398]
["APM-SC06ADK",4716005100,436.72,null,424]
["APM-SC08ADK",4716005200,505.73,null,491]
["APM-SC10ADK",4716005300,552.08000000000004,null,536]
["APM-SC03DDK",4716005900,409.94,null,398]
["APM-SC05DDK",4716006000,437.75,null,425]
["APM-SC06DDK",4716006100,506.76,null,492]
["APM-SC07DDK",4716006200,552.08000000000004,null,536]
["APM-SA01ACN-8",4716098000,416.12,null,404]
{"$rows_left_out":908}